Hospital Code,Hospital beds,Patient code,Unnamed: 3,Age,Sex,height,weight,PCR positive,IgM/IgG,comorbidities,tobacco,asthma,copd,bronchiectasis,ILD,SAHS,CHF,coronary disease,Myocardial infarction,atrial fibrillation,hypertension,peripheral vascular disease,cerebrovascular disease,dementia,renal failure,hemodialisys,liver disease,peptic ulcer,diabetes,connective tissue disease,leukemia,lymphoma,leukemia or lymphoma,cancer,asplenia,HIV,complicated DM,charlson,chronic therapies,chemotherapy,biologic treatments,type of biologic treatment,inhaled corticosteroids,chronic corticosteroids,oxygen,NIMV,ACEI,ARA-II,statins,chloroquine,NSAID,NSAID type,inmunosupressive therapy,previous conditions,nursing home,AE visits previous year,AE visits previous week,hospital admissions last year,last admission length,influenza vaccination previous year,Pneumococcal vaccination PV13,Pneumococcal vaccination PS23,date of admission,date of symptoms debut,cough, dyspnea,hemoptysis,sore throat,fever,head pain,rhinorrea,myalgia,sputum production,diarrhea,chest pain,nausea,vomiting,confusional state,interstital x-ray pattern,multilobar disease,single lobar disease,bilateral disease,pleural effusion,lung cavitation,diastolic tension,systolic tension,heart rate,temperature,respiratory rate,leukocyte count,hemoglobin,platelets,neutrophils,neutrophils%,Eosinophils,Eos%,lymphocites,Lymph%,neutrophil/lymphocite,ESR,CRP,procalcitonin,UREA,creatinin,CPK,AST,ALT,GGT,alkaline phospatase,IL6,sodium,potasium,LDH,ferritin,troponin,albumin,DD,protrombin time,pH,PaO2,PaCO2,FIO2,SAO2,respiratory failure,PAFI,SAFI,Flu PCR,blood cultures,urine pneumococcal antigen test,urine legionella antigen test,lactate,ceftriaxone,ceftriaxone date,ceftriaxone end date,azythromicin,azythromicin date,azythromicin end date,chloroquine.1,chloroquine date,chloroquine end date,lopinavir/ritonavir,L/R date,L/R end date,oseltamivir,oseltamivir date,oseltamivir end date,remdesivir,remdesivir date,remdesivir end date,interferon,interferon date,interferon end date,tocilizumab,tocil date,tocil end date,tocil patient intubated,tocil DD,tocil IL6,Tocil SaO2,Tocil PaO2,tocil FiO2,tocil SAFI,tocil PAFI,corticosteroids,cortic date,cortic end date,cortic interval,cortic dose,cortic bolus,cortic bolus number,cortic bolus dose,cortic SaO2,CORTIC_PAO2,CORTIC_FIO2,CORTIC_SAFI,CORTIC_PAFI,dead,intubation,dead or intubation,intubation date,intubation end date,hospital discharge date,readmission,readmission death
1,1341,01_001,,120.33424657534246,1,,,1,2,1.0,0.0,0,0,0,0,0,0,0,0,0,0,1,0,1,0,0,0,0,1,0,0,0,0,0,0,0,0,3,1.0,0.0,0.0,88888,0.0,0.0,0.0,0.0,0.0,0.0,1.0,0.0,0.0,88888,0.0,1.0,0.0,0.0,0.0,0.0,99999.0,1.0,0.0,0.0,2020-04-01,2020-03-26 00:00:00,1,1,0,0,1,0,0,0,1,0,0,0,0,0,0,1,0,1,0,0,77.0,121.0,80.0,35.0,,5.0,15.2,275.0,3.87,77.4,0.08,1.5,0.71,14.2,5.450704225352113,,56.4,,50.0,1.1,,52.0,45.0,121.0,52.0,,139.0,4.4,334.0,791.0,,3.8,1675.0,,7.48,61.0,34.0,99999.0,93.0,0.0,99999,99999,2.0,2.0,99999.0,99999.0,1.0,1,2020-04-02 00:00:00,2020-04-12 00:00:00,1,2020-04-02 00:00:00,2020-04-06 00:00:00,1,2020-04-02 00:00:00,2020-04-06 00:00:00,1.0,2020-04-02 00:00:00,2020-04-08 00:00:00,0.0,8888-01-01 00:00:00,8888-01-01 00:00:00,0.0,8888-01-01 00:00:00,8888-01-01 00:00:00,0.0,8888-01-01 00:00:00,8888-01-01 00:00:00,0.0,88888.0,8888-01-01 00:00:00,88888.0,88888.0,88888.0,88888.0,88888.0,88888.0,88888.0,88888.0,0,8888-01-01 00:00:00,8888-01-01 00:00:00,88888.0,,88888.0,88888.0,88888.0,88888.0,88888.0,88888.0,88888.0,88888.0,0,0,0,8888-01-01 00:00:00,8888-01-01 00:00:00,2020-04-13,0.0,88888
1,1341,01_002,,120.34246575342466,2,,,1,2,0.0,,0,0,0,0,0,0,0,0,0,0,0,0,0,0,0,0,0,0,0,0,0,0,0,0,0,0,0,0.0,88888.0,88888.0,88888,88888.0,88888.0,88888.0,88888.0,0.0,0.0,0.0,88888.0,88888.0,88888,88888.0,1.0,0.0,0.0,0.0,0.0,99999.0,0.0,0.0,0.0,2020-04-04,2020-03-28 00:00:00,1,0,0,0,1,0,0,1,0,1,0,0,0,0,1,0,1,0,0,0,60.0,120.0,70.0,36.8,,4.43,14.3,135.0,2.78,62.8,0.03,0.7,1.11,24.9,2.5045045045045042,,8.1,,41.0,0.8,,24.0,23.0,,,,138.0,4.5,209.0,,11.0,,359.0,,,,,99999.0,97.0,0.0,99999,99999,2.0,2.0,2.0,2.0,99999.0,1,2020-04-04 00:00:00,2020-04-10 00:00:00,1,2020-04-04 00:00:00,2020-04-06 00:00:00,1,2020-04-04 00:00:00,2020-04-09 00:00:00,0.0,8888-01-01 00:00:00,8888-01-01 00:00:00,0.0,8888-01-01 00:00:00,8888-01-01 00:00:00,0.0,8888-01-01 00:00:00,8888-01-01 00:00:00,0.0,8888-01-01 00:00:00,8888-01-01 00:00:00,0.0,88888.0,8888-01-01 00:00:00,88888.0,88888.0,88888.0,88888.0,88888.0,88888.0,88888.0,88888.0,0,8888-01-01 00:00:00,8888-01-01 00:00:00,88888.0,,88888.0,88888.0,88888.0,88888.0,88888.0,88888.0,88888.0,88888.0,0,0,0,8888-01-01 00:00:00,8888-01-01 00:00:00,2020-04-16,0.0,88888
1,1341,01_003,,120.32876712328768,2,,,1,2,0.0,,0,0,0,0,0,0,0,0,0,0,0,0,0,0,0,0,0,0,0,0,0,0,0,0,0,0,0,0.0,88888.0,88888.0,88888,88888.0,88888.0,88888.0,88888.0,0.0,0.0,0.0,88888.0,88888.0,88888,88888.0,1.0,0.0,0.0,0.0,0.0,99999.0,0.0,0.0,0.0,2020-03-30,2020-03-19 00:00:00,1,1,0,0,1,0,0,1,0,1,0,0,0,0,0,1,0,0,0,0,85.0,149.0,100.0,36.8,24.0,7.89,12.6,216.0,7.25,92.0,0.01,0.1,0.42,5.3,17.261904761904763,,205.4,,30.0,0.8,52.0,91.0,57.0,74.0,103.0,18.4,137.0,4.7,704.0,854.0,14.0,3.3,1569.0,,7.5,59.0,31.0,99999.0,92.0,0.0,99999,99999,2.0,0.0,0.0,0.0,0.9,1,2020-03-30 00:00:00,2020-04-08 00:00:00,1,2020-03-30 00:00:00,2020-04-03 00:00:00,1,2020-03-30 00:00:00,2020-04-03 00:00:00,1.0,2020-03-30 00:00:00,2020-04-08 00:00:00,0.0,8888-01-01 00:00:00,8888-01-01 00:00:00,0.0,8888-01-01 00:00:00,8888-01-01 00:00:00,0.0,8888-01-01 00:00:00,8888-01-01 00:00:00,0.0,88888.0,8888-01-01 00:00:00,88888.0,88888.0,88888.0,88888.0,88888.0,88888.0,88888.0,88888.0,0,8888-01-01 00:00:00,8888-01-01 00:00:00,88888.0,,88888.0,88888.0,88888.0,88888.0,88888.0,88888.0,88888.0,88888.0,0,0,0,8888-01-01 00:00:00,8888-01-01 00:00:00,2020-04-11,0.0,88888
1,1341,01_004,,120.27397260273973,1,,,1,2,1.0,0.0,0,0,0,0,0,1,1,0,1,1,1,1,0,1,0,0,0,0,0,0,0,0,0,0,0,0,7,1.0,0.0,0.0,88888,0.0,1.0,0.0,0.0,0.0,0.0,0.0,0.0,1.0,Ácido acetilsalicílico,1.0,1.0,0.0,1.0,0.0,2.0,17.0,0.0,0.0,0.0,2020-03-10,2020-02-27 00:00:00,0,0,0,0,1,0,0,0,0,0,0,0,0,0,0,0,1,0,0,0,60.0,130.0,61.0,37.0,,5.86,12.2,148.0,4.09,69.9,0.02,0.3,1.3,22.3,3.146153846153846,94.0,50.1,,51.0,1.12,202.0,46.0,36.0,26.0,76.0,,135.0,5.4,261.0,1899.0,,3.3,,,,,,99999.0,97.0,0.0,99999,99999,2.0,0.0,0.0,0.0,99999.0,1,2020-03-10 00:00:00,2020-03-29 00:00:00,1,2020-03-10 00:00:00,2020-03-16 00:00:00,0,8888-01-01 00:00:00,8888-01-01 00:00:00,1.0,2020-03-10 00:00:00,2020-03-27 00:00:00,0.0,8888-01-01 00:00:00,8888-01-01 00:00:00,0.0,8888-01-01 00:00:00,8888-01-01 00:00:00,0.0,8888-01-01 00:00:00,8888-01-01 00:00:00,0.0,88888.0,8888-01-01 00:00:00,88888.0,88888.0,88888.0,88888.0,88888.0,88888.0,88888.0,88888.0,1,2020-03-10 00:00:00,9999-01-01 00:00:00,,40.0,1.0,1.0,250.0,99999.0,99999.0,99999.0,99999.0,99999.0,0,0,0,8888-01-01 00:00:00,8888-01-01 00:00:00,2020-04-03,1.0,1
1,1341,01_005,,120.30958904109589,1,,,1,2,0.0,,0,0,0,0,0,0,0,0,0,0,0,0,0,0,0,0,0,0,0,0,0,0,0,0,0,0,0,1.0,0.0,0.0,88888,0.0,0.0,0.0,0.0,0.0,0.0,1.0,0.0,0.0,88888,0.0,1.0,0.0,0.0,0.0,0.0,99999.0,0.0,0.0,0.0,2020-03-23,2020-03-16 00:00:00,1,1,0,0,1,1,0,1,0,0,0,0,0,0,0,1,0,1,0,0,80.0,120.0,78.0,36.7,,3.68,16.0,101.0,2.54,69.0,0.01,0.2,0.8,21.9,3.175,23.0,20.2,,31.0,0.95,62.0,71.0,70.0,56.0,43.0,22.7,141.0,4.0,292.0,766.0,,3.6,438.0,,7.44,31.0,76.0,99999.0,97.0,0.0,99999,99999,2.0,0.0,0.0,0.0,99999.0,1,2020-03-23 00:00:00,2020-04-01 00:00:00,1,2020-03-23 00:00:00,2020-03-25 00:00:00,1,2020-03-23 00:00:00,2020-03-31 00:00:00,1.0,2020-03-23 00:00:00,2020-04-02 00:00:00,0.0,8888-01-01 00:00:00,8888-01-01 00:00:00,0.0,8888-01-01 00:00:00,8888-01-01 00:00:00,0.0,8888-01-01 00:00:00,8888-01-01 00:00:00,0.0,88888.0,8888-01-01 00:00:00,88888.0,88888.0,88888.0,88888.0,88888.0,88888.0,88888.0,88888.0,0,8888-01-01 00:00:00,8888-01-01 00:00:00,88888.0,,88888.0,88888.0,88888.0,88888.0,88888.0,88888.0,88888.0,88888.0,0,0,0,8888-01-01 00:00:00,8888-01-01 00:00:00,2020-04-06,0.0,88888
1,1341,01_007,,120.3890410958904,1,,,1,2,1.0,0.0,0,0,0,0,0,1,1,0,1,1,1,1,1,0,0,1,0,1,0,0,1,1,0,0,0,0,10,1.0,0.0,0.0,88888,0.0,1.0,0.0,0.0,0.0,0.0,1.0,0.0,0.0,88888,1.0,1.0,0.0,3.0,0.0,4.0,34.0,0.0,0.0,0.0,2020-04-21,2020-04-12 00:00:00,1,1,0,0,0,0,0,0,1,0,0,0,0,1,0,1,0,1,0,0,47.0,88.0,64.0,35.9,,8.43,10.8,155.0,4.78,56.7,0.01,0.1,3.0,37.3,1.5933333333333335,,39.2,,41.0,0.92,49.0,33.0,59.0,775.0,438.0,6.5,147.0,3.6,279.0,903.0,,3.3,772.0,,7.62,81.0,31.0,99999.0,97.0,0.0,99999,99999,2.0,0.0,1.0,0.0,1.9,1,2020-04-21 00:00:00,2020-04-30 00:00:00,1,2020-04-21 00:00:00,2020-04-27 00:00:00,1,2020-04-21 00:00:00,2020-05-03 00:00:00,1.0,2020-04-21 00:00:00,2020-04-22 00:00:00,0.0,8888-01-01 00:00:00,8888-01-01 00:00:00,0.0,8888-01-01 00:00:00,8888-01-01 00:00:00,0.0,8888-01-01 00:00:00,8888-01-01 00:00:00,0.0,88888.0,8888-01-01 00:00:00,88888.0,88888.0,88888.0,88888.0,88888.0,88888.0,88888.0,88888.0,1,2020-04-23 00:00:00,9999-01-01 00:00:00,,60.0,0.0,88888.0,88888.0,99999.0,99999.0,99999.0,99999.0,99999.0,0,0,0,8888-01-01 00:00:00,8888-01-01 00:00:00,2020-05-05,1.0,0
1,1341,01_008,,120.31232876712329,1,,,1,2,1.0,0.0,0,0,0,0,0,0,1,0,0,0,0,0,1,0,0,0,0,1,0,0,0,0,0,0,0,0,3,0.0,88888.0,88888.0,88888,88888.0,88888.0,88888.0,88888.0,0.0,0.0,0.0,88888.0,88888.0,88888,88888.0,1.0,1.0,1.0,0.0,1.0,270.0,1.0,1.0,0.0,2020-03-24,2020-03-18 00:00:00,0,1,0,0,1,0,0,0,0,0,0,0,0,0,0,0,1,0,0,0,77.0,109.0,113.0,36.5,26.0,22.6,10.4,561.0,21.63,95.7,0.0,0.0,0.63,2.8,34.33333333333333,,251.0,,164.0,2.42,,960.0,582.0,,,,143.0,6.0,573.0,,,,3380.0,,7.44,56.0,38.0,99999.0,88.0,1.0,99999,99999,2.0,2.0,2.0,2.0,2.3,1,2020-03-24 00:00:00,2020-03-24 00:00:00,1,2020-03-24 00:00:00,2020-03-24 00:00:00,0,8888-01-01 00:00:00,8888-01-01 00:00:00,0.0,8888-01-01 00:00:00,8888-01-01 00:00:00,0.0,8888-01-01 00:00:00,8888-01-01 00:00:00,0.0,8888-01-01 00:00:00,8888-01-01 00:00:00,0.0,8888-01-01 00:00:00,8888-01-01 00:00:00,0.0,88888.0,8888-01-01 00:00:00,88888.0,88888.0,88888.0,88888.0,88888.0,88888.0,88888.0,88888.0,0,8888-01-01 00:00:00,8888-01-01 00:00:00,88888.0,,88888.0,88888.0,88888.0,88888.0,88888.0,88888.0,88888.0,88888.0,1,0,1,8888-01-01 00:00:00,8888-01-01 00:00:00,2020-03-25,,88888
1,1341,01_009,,120.31780821917808,1,,,1,2,1.0,0.0,0,0,0,0,0,1,1,0,1,1,0,0,0,1,0,0,0,0,0,0,0,0,1,0,0,0,6,1.0,0.0,0.0,88888,0.0,0.0,0.0,0.0,0.0,0.0,0.0,0.0,0.0,88888,0.0,1.0,0.0,2.0,0.0,2.0,240.0,1.0,0.0,0.0,2020-03-26,2020-03-19 00:00:00,1,1,0,0,1,0,0,0,0,0,0,0,0,0,0,1,0,1,1,0,67.0,120.0,80.0,35.1,,5.53,6.7,169.0,4.28,77.5,0.16,2.8,0.53,9.6,8.075471698113208,,,,144.0,2.99,,15.0,10.0,16.0,49.0,,140.0,4.1,207.0,48.0,,3.7,,,7.43,58.0,37.0,99999.0,88.0,1.0,99999,99999,2.0,0.0,0.0,0.0,1.8,0,8888-01-01 00:00:00,8888-01-01 00:00:00,0,8888-01-01 00:00:00,8888-01-01 00:00:00,1,2020-04-02 00:00:00,2020-04-07 00:00:00,1.0,2020-04-02 00:00:00,2020-04-07 00:00:00,0.0,8888-01-01 00:00:00,8888-01-01 00:00:00,0.0,8888-01-01 00:00:00,8888-01-01 00:00:00,0.0,8888-01-01 00:00:00,8888-01-01 00:00:00,0.0,88888.0,8888-01-01 00:00:00,88888.0,88888.0,88888.0,88888.0,88888.0,88888.0,88888.0,88888.0,1,2020-04-06 00:00:00,9999-01-01 00:00:00,,60.0,1.0,1.0,250.0,99999.0,99999.0,99999.0,99999.0,99999.0,1,0,1,8888-01-01 00:00:00,8888-01-01 00:00:00,2020-04-08,,88888
1,1341,01_010,,120.38082191780822,1,,,1,2,1.0,1.0,0,1,0,0,0,1,1,0,0,1,0,0,0,1,0,0,0,0,0,0,0,0,1,0,0,0,7,1.0,0.0,0.0,88888,1.0,0.0,0.0,1.0,0.0,0.0,1.0,0.0,0.0,88888,0.0,1.0,0.0,0.0,0.0,6.0,18.0,1.0,1.0,1.0,2020-04-18,2020-04-15 00:00:00,1,1,0,0,1,0,0,0,1,0,0,0,0,0,0,1,0,1,1,0,58.0,115.0,69.0,36.2,16.0,26.37,10.3,205.0,23.23,88.1,0.11,0.4,1.45,5.5,16.020689655172415,,67.5,,136.0,1.85,,18.0,20.0,144.0,110.0,,144.0,4.4,180.0,,,,1263.0,,7.4,69.0,51.0,99999.0,94.0,0.0,99999,99999,2.0,2.0,0.0,0.0,0.5,0,8888-01-01 00:00:00,8888-01-01 00:00:00,1,2020-04-20 00:00:00,2020-04-24 00:00:00,1,2020-04-20 00:00:00,2020-04-25 00:00:00,1.0,2020-04-20 00:00:00,2020-04-24 00:00:00,0.0,8888-01-01 00:00:00,8888-01-01 00:00:00,0.0,8888-01-01 00:00:00,8888-01-01 00:00:00,0.0,8888-01-01 00:00:00,8888-01-01 00:00:00,0.0,88888.0,8888-01-01 00:00:00,88888.0,88888.0,88888.0,88888.0,88888.0,88888.0,88888.0,88888.0,1,2020-04-18 00:00:00,9999-01-01 00:00:00,,60.0,0.0,88888.0,88888.0,94.0,69.0,99999.0,99999.0,99999.0,0,0,0,8888-01-01 00:00:00,8888-01-01 00:00:00,2020-04-28,1.0,0
1,1341,01_011,,120.32876712328768,1,,,1,2,1.0,0.0,0,0,0,0,0,0,0,0,0,1,1,0,0,0,0,0,0,0,0,0,0,0,0,0,0,0,1,1.0,0.0,0.0,88888,0.0,0.0,0.0,0.0,0.0,1.0,0.0,0.0,0.0,88888,0.0,1.0,0.0,1.0,1.0,0.0,99999.0,0.0,0.0,0.0,2020-03-30,2020-03-16 00:00:00,1,0,0,0,1,0,0,0,0,1,0,0,0,0,0,1,0,1,0,0,93.0,120.0,91.0,35.9,15.0,4.89,13.0,270.0,3.93,80.3,0.02,0.4,0.58,11.8,6.775862068965518,,,,39.0,0.9,,139.0,256.0,154.0,106.0,8.3,142.0,4.5,362.0,2716.0,,4.4,455.0,,,,,99999.0,97.0,0.0,99999,99999,2.0,99999.0,0.0,0.0,99999.0,1,2020-03-29 00:00:00,2020-04-08 00:00:00,1,2020-03-29 00:00:00,2020-04-01 00:00:00,1,2020-03-30 00:00:00,2020-04-06 00:00:00,1.0,2020-03-30 00:00:00,2020-04-08 00:00:00,0.0,8888-01-01 00:00:00,8888-01-01 00:00:00,0.0,8888-01-01 00:00:00,8888-01-01 00:00:00,0.0,8888-01-01 00:00:00,8888-01-01 00:00:00,0.0,88888.0,8888-01-01 00:00:00,88888.0,88888.0,88888.0,88888.0,88888.0,88888.0,88888.0,88888.0,0,8888-01-01 00:00:00,8888-01-01 00:00:00,88888.0,,88888.0,88888.0,88888.0,88888.0,88888.0,88888.0,88888.0,88888.0,0,0,0,8888-01-01 00:00:00,8888-01-01 00:00:00,2020-04-09,0.0,88888
1,1341,01_012,,120.35342465753425,2,,,1,2,1.0,0.0,0,0,0,0,0,0,1,0,0,1,0,0,1,1,0,0,0,0,0,0,0,0,1,0,0,0,6,1.0,0.0,0.0,88888,0.0,0.0,0.0,0.0,0.0,0.0,1.0,0.0,1.0,Ácido acetilsalicílico,0.0,1.0,1.0,4.0,0.0,1.0,360.0,1.0,0.0,0.0,2020-04-08,2020-03-20 00:00:00,1,0,0,0,1,0,0,0,1,0,0,0,0,0,0,0,1,0,0,0,73.0,105.0,94.0,36.5,18.0,11.17,11.6,498.0,8.51,76.1,0.04,0.4,1.76,15.7,4.8352272727272725,,1.7,,82.0,1.06,,28.0,35.0,35.0,103.0,,145.0,4.9,227.0,52.0,14.0,3.7,1526.0,,,,,99999.0,94.0,0.0,99999,99999,2.0,2.0,0.0,0.0,99999.0,0,8888-01-01 00:00:00,8888-01-01 00:00:00,1,2020-04-02 00:00:00,2020-04-08 00:00:00,0,8888-01-01 00:00:00,8888-01-01 00:00:00,0.0,8888-01-01 00:00:00,8888-01-01 00:00:00,0.0,8888-01-01 00:00:00,8888-01-01 00:00:00,0.0,8888-01-01 00:00:00,8888-01-01 00:00:00,0.0,8888-01-01 00:00:00,8888-01-01 00:00:00,0.0,88888.0,8888-01-01 00:00:00,88888.0,88888.0,88888.0,88888.0,88888.0,88888.0,88888.0,88888.0,0,8888-01-01 00:00:00,8888-01-01 00:00:00,88888.0,,88888.0,88888.0,88888.0,88888.0,88888.0,88888.0,88888.0,88888.0,0,0,0,8888-01-01 00:00:00,8888-01-01 00:00:00,2020-04-27,1.0,1
1,1341,01_013,,120.34520547945205,2,,,1,2,1.0,0.0,0,0,0,0,0,0,0,0,0,0,0,0,1,0,0,0,0,0,0,0,0,0,0,0,0,0,1,1.0,0.0,0.0,88888,0.0,0.0,0.0,0.0,0.0,0.0,0.0,0.0,0.0,88888,0.0,1.0,1.0,0.0,0.0,0.0,99999.0,0.0,0.0,0.0,2020-04-05,2020-04-04 00:00:00,1,0,0,0,1,0,0,0,1,0,0,0,0,0,0,0,1,0,0,0,90.0,113.0,107.0,37.7,,3.73,14.3,120.0,2.02,54.0,0.01,0.2,1.1,29.5,1.8363636363636362,,90.8,,52.0,0.8,186.0,46.0,31.0,,82.0,32.1,134.0,3.7,311.0,821.0,,,469.0,,,,,99999.0,97.0,0.0,99999,99999,2.0,0.0,0.0,0.0,99999.0,0,8888-01-01 00:00:00,8888-01-01 00:00:00,1,2020-04-07 00:00:00,2020-04-12 00:00:00,1,2020-04-05 00:00:00,2020-04-10 00:00:00,1.0,2020-04-05 00:00:00,2020-04-11 00:00:00,0.0,8888-01-01 00:00:00,8888-01-01 00:00:00,0.0,8888-01-01 00:00:00,8888-01-01 00:00:00,0.0,8888-01-01 00:00:00,8888-01-01 00:00:00,0.0,88888.0,8888-01-01 00:00:00,88888.0,88888.0,88888.0,88888.0,88888.0,88888.0,88888.0,88888.0,0,8888-01-01 00:00:00,8888-01-01 00:00:00,88888.0,,88888.0,88888.0,88888.0,88888.0,88888.0,88888.0,88888.0,88888.0,0,0,0,8888-01-01 00:00:00,8888-01-01 00:00:00,2020-04-18,0.0,88888
1,1341,01_014,,120.34794520547945,1,,,1,2,1.0,1.0,0,0,0,0,0,0,0,0,0,0,0,0,0,0,0,0,0,1,0,0,0,0,1,0,0,0,3,1.0,1.0,0.0,88888,0.0,0.0,0.0,0.0,0.0,0.0,1.0,0.0,0.0,88888,1.0,1.0,0.0,2.0,,2.0,30.0,1.0,1.0,0.0,2020-04-06,2020-03-31 00:00:00,0,0,0,0,0,0,0,0,0,0,0,1,0,0,0,1,0,0,0,0,63.0,116.0,127.0,38.1,,4.12,9.0,348.0,3.26,79.2,0.0,0.1,0.47,11.4,6.9361702127659575,,128.0,,56.0,0.93,,28.0,46.0,134.0,77.0,,144.0,2.1,159.0,1193.0,36.0,3.1,3212.0,,,,,99999.0,99.0,0.0,99999,99999,2.0,0.0,0.0,0.0,99999.0,1,2020-04-07 00:00:00,2020-04-17 00:00:00,1,2020-04-07 00:00:00,2020-04-12 00:00:00,1,2020-04-07 00:00:00,2020-04-12 00:00:00,1.0,2020-04-07 00:00:00,2020-04-19 00:00:00,0.0,8888-01-01 00:00:00,8888-01-01 00:00:00,0.0,8888-01-01 00:00:00,8888-01-01 00:00:00,0.0,8888-01-01 00:00:00,8888-01-01 00:00:00,1.0,1.0,2020-04-21 00:00:00,,1873.0,112.0,99999.0,99999.0,99999.0,99999.0,99999.0,1,2020-04-10 00:00:00,9999-01-01 00:00:00,,60.0,1.0,1.0,250.0,99999.0,99999.0,99999.0,99999.0,99999.0,1,0,1,8888-01-01 00:00:00,8888-01-01 00:00:00,2020-04-22,,88888
1,1341,01_015,,120.32054794520548,1,,,1,2,1.0,1.0,1,0,0,0,0,0,1,0,0,1,0,0,0,0,0,0,0,1,0,0,0,0,0,0,0,0,2,1.0,0.0,0.0,88888,0.0,1.0,0.0,0.0,0.0,1.0,1.0,0.0,0.0,88888,1.0,1.0,0.0,0.0,0.0,0.0,99999.0,1.0,0.0,0.0,2020-03-27,2020-03-16 00:00:00,1,0,0,0,1,0,0,0,0,0,0,0,0,0,0,1,0,0,0,0,85.0,113.0,85.0,35.5,,6.79,12.0,138.0,5.9,86.8,0.06,0.9,0.39,5.7,15.128205128205128,,50.0,,76.0,1.31,136.0,29.0,21.0,50.0,62.0,,137.0,4.5,174.0,214.0,,3.9,308.0,,,,,99999.0,97.0,0.0,99999,99999,2.0,2.0,2.0,2.0,99999.0,1,2020-03-28 00:00:00,2020-04-03 00:00:00,1,2020-03-28 00:00:00,2020-04-03 00:00:00,1,2020-03-28 00:00:00,2020-04-03 00:00:00,0.0,8888-01-01 00:00:00,8888-01-01 00:00:00,0.0,8888-01-01 00:00:00,8888-01-01 00:00:00,0.0,8888-01-01 00:00:00,8888-01-01 00:00:00,0.0,8888-01-01 00:00:00,8888-01-01 00:00:00,0.0,88888.0,8888-01-01 00:00:00,88888.0,88888.0,88888.0,88888.0,88888.0,88888.0,88888.0,88888.0,0,8888-01-01 00:00:00,8888-01-01 00:00:00,88888.0,,88888.0,88888.0,88888.0,88888.0,88888.0,88888.0,88888.0,88888.0,0,0,0,8888-01-01 00:00:00,8888-01-01 00:00:00,2020-04-03,0.0,88888
1,1341,01_016,,120.32054794520548,1,,,1,2,1.0,1.0,0,1,0,0,0,1,1,0,0,1,0,0,0,1,0,0,0,1,0,0,0,0,0,0,0,1,7,1.0,0.0,0.0,88888,1.0,0.0,0.0,0.0,0.0,1.0,1.0,0.0,1.0,Ácido acetilsalicílico,1.0,1.0,,2.0,0.0,0.0,99999.0,1.0,0.0,1.0,2020-03-27,2020-03-20 00:00:00,1,1,0,0,1,0,0,1,0,0,0,0,0,0,0,1,0,1,0,0,87.0,139.0,98.0,37.7,21.0,7.74,14.6,173.0,6.39,82.6,0.03,0.4,0.59,7.6,10.830508474576272,,185.5,,158.0,2.38,,24.0,15.0,62.0,101.0,,138.0,4.8,153.0,281.0,86.0,3.3,1807.0,,7.43,54.0,34.0,99999.0,89.0,1.0,99999,99999,2.0,2.0,0.0,0.0,0.7,1,2020-03-27 00:00:00,2020-04-02 00:00:00,1,2020-03-27 00:00:00,2020-03-30 00:00:00,1,2020-03-28 00:00:00,2020-04-01 00:00:00,0.0,8888-01-01 00:00:00,8888-01-01 00:00:00,0.0,8888-01-01 00:00:00,8888-01-01 00:00:00,0.0,8888-01-01 00:00:00,8888-01-01 00:00:00,0.0,8888-01-01 00:00:00,8888-01-01 00:00:00,0.0,88888.0,8888-01-01 00:00:00,88888.0,88888.0,88888.0,88888.0,88888.0,88888.0,88888.0,88888.0,1,2020-03-27 00:00:00,9999-01-01 00:00:00,,60.0,0.0,88888.0,88888.0,89.0,54.0,99999.0,99999.0,99999.0,1,0,1,8888-01-01 00:00:00,8888-01-01 00:00:00,2020-04-02,,88888
1,1341,01_017,,120.32054794520548,2,163.0,57.0,1,2,1.0,1.0,0,0,1,0,0,0,0,0,0,0,0,0,0,0,0,0,0,0,0,0,0,0,0,0,0,0,0,1.0,0.0,1.0,Rituximab,0.0,0.0,0.0,0.0,0.0,0.0,1.0,0.0,1.0,Indometacina,1.0,1.0,0.0,0.0,0.0,0.0,99999.0,1.0,1.0,1.0,2020-03-27,2020-03-09 00:00:00,1,1,0,0,1,0,0,0,0,0,0,0,0,0,0,1,0,1,0,0,55.0,95.0,88.0,38.0,,4.94,14.9,248.0,3.59,72.6,0.02,0.3,0.73,14.8,4.917808219178082,,51.7,0.11,21.0,0.8,46.0,32.0,33.0,16.0,87.0,15.4,140.0,4.0,218.0,305.0,5.0,3.9,623.0,,7.47,75.0,35.0,99999.0,95.0,0.0,99999,99999,2.0,0.0,0.0,0.0,0.7,1,2020-03-27 00:00:00,2020-04-06 00:00:00,1,2020-03-27 00:00:00,2020-04-02 00:00:00,1,2020-03-28 00:00:00,2020-04-06 00:00:00,1.0,2020-03-28 00:00:00,2020-04-06 00:00:00,0.0,8888-01-01 00:00:00,8888-01-01 00:00:00,0.0,8888-01-01 00:00:00,8888-01-01 00:00:00,0.0,8888-01-01 00:00:00,8888-01-01 00:00:00,0.0,88888.0,8888-01-01 00:00:00,88888.0,88888.0,88888.0,88888.0,88888.0,88888.0,88888.0,88888.0,1,2020-04-03 00:00:00,9999-01-01 00:00:00,,60.0,1.0,3.0,250.0,99999.0,99999.0,99999.0,99999.0,99999.0,0,0,0,8888-01-01 00:00:00,8888-01-01 00:00:00,2020-05-07,0.0,88888
1,1341,01_018,,120.32054794520548,2,,,1,2,1.0,0.0,1,0,0,0,0,0,0,0,0,1,0,0,0,0,0,0,0,1,0,0,0,0,0,0,0,0,1,1.0,0.0,0.0,88888,1.0,0.0,0.0,0.0,0.0,0.0,1.0,0.0,0.0,88888,0.0,1.0,0.0,2.0,0.0,0.0,99999.0,1.0,0.0,1.0,2020-03-27,2020-03-20 00:00:00,0,0,0,0,1,0,0,0,0,1,0,0,0,0,0,0,1,0,0,0,63.0,112.0,84.0,35.4,15.0,5.53,11.6,311.0,4.13,74.6,0.04,0.7,0.98,17.7,4.214285714285714,,72.8,0.09,40.0,0.84,46.0,20.0,26.0,15.0,76.0,,138.0,4.5,215.0,30.0,,4.1,1285.0,,7.43,55.0,36.0,0.21,93.0,0.0,262,443,2.0,2.0,0.0,0.0,2.5,1,2020-03-27 00:00:00,2020-04-02 00:00:00,1,2020-03-27 00:00:00,2020-03-31 00:00:00,1,2020-03-30 00:00:00,2020-04-02 00:00:00,0.0,8888-01-01 00:00:00,8888-01-01 00:00:00,0.0,8888-01-01 00:00:00,8888-01-01 00:00:00,0.0,8888-01-01 00:00:00,8888-01-01 00:00:00,0.0,8888-01-01 00:00:00,8888-01-01 00:00:00,0.0,88888.0,8888-01-01 00:00:00,88888.0,88888.0,88888.0,88888.0,88888.0,88888.0,88888.0,88888.0,0,8888-01-01 00:00:00,8888-01-01 00:00:00,88888.0,,88888.0,88888.0,88888.0,88888.0,88888.0,88888.0,88888.0,88888.0,0,0,0,8888-01-01 00:00:00,8888-01-01 00:00:00,2020-04-01,0.0,88888
1,1341,01_019,,120.30958904109589,2,,,1,2,0.0,,0,0,0,0,0,0,0,0,0,0,0,0,0,0,0,0,0,0,0,0,0,0,0,0,0,0,0,0.0,88888.0,88888.0,88888,88888.0,88888.0,88888.0,88888.0,0.0,0.0,0.0,88888.0,88888.0,88888,88888.0,1.0,1.0,2.0,0.0,0.0,99999.0,1.0,0.0,0.0,2020-03-23,2020-03-18 00:00:00,1,0,0,0,1,0,0,1,0,1,0,1,0,0,0,1,0,1,0,0,73.0,131.0,76.0,36.1,22.0,5.13,14.7,146.0,3.83,74.7,0.01,0.1,1.04,20.3,3.6826923076923075,,176.5,,46.0,0.8,58.0,37.0,35.0,36.0,60.0,29.4,140.0,4.0,355.0,628.0,45.0,3.6,756.0,,,,,99999.0,97.0,0.0,99999,99999,,0.0,0.0,0.0,99999.0,1,2020-03-22 00:00:00,2020-03-31 00:00:00,1,2020-03-22 00:00:00,2020-03-24 00:00:00,1,2020-03-22 00:00:00,2020-03-29 00:00:00,1.0,2020-03-22 00:00:00,2020-04-01 00:00:00,0.0,8888-01-01 00:00:00,8888-01-01 00:00:00,0.0,8888-01-01 00:00:00,8888-01-01 00:00:00,0.0,8888-01-01 00:00:00,8888-01-01 00:00:00,1.0,2.0,2020-03-25 00:00:00,,99999.0,99.8,99999.0,99999.0,99999.0,99999.0,99999.0,0,8888-01-01 00:00:00,8888-01-01 00:00:00,88888.0,,88888.0,88888.0,88888.0,88888.0,88888.0,88888.0,88888.0,88888.0,0,0,0,8888-01-01 00:00:00,8888-01-01 00:00:00,2020-04-03,0.0,88888
1,1341,01_020,,120.2958904109589,1,,,1,2,1.0,0.0,0,0,0,0,0,0,0,0,1,1,0,1,0,0,0,0,0,0,0,0,0,0,1,0,0,0,4,1.0,0.0,0.0,88888,0.0,0.0,0.0,0.0,1.0,0.0,0.0,0.0,1.0,Dexketoprofeno,0.0,1.0,1.0,0.0,0.0,0.0,99999.0,1.0,0.0,1.0,2020-03-18,2020-03-17 00:00:00,1,0,0,0,1,0,0,0,0,0,0,0,0,0,0,0,1,0,0,0,40.0,113.0,78.0,37.9,,10.12,12.0,210.0,8.18,80.8,0.01,0.1,1.12,11.1,7.303571428571428,,,,71.0,0.91,,50.0,43.0,,,,134.0,4.2,,,,,,,7.47,60.0,37.0,99999.0,92.0,0.0,99999,99999,0.0,2.0,2.0,2.0,0.6,0,8888-01-01 00:00:00,8888-01-01 00:00:00,0,8888-01-01 00:00:00,8888-01-01 00:00:00,1,2020-03-19 00:00:00,2020-03-22 00:00:00,1.0,2020-03-19 00:00:00,2020-03-20 00:00:00,0.0,8888-01-01 00:00:00,8888-01-01 00:00:00,0.0,8888-01-01 00:00:00,8888-01-01 00:00:00,0.0,8888-01-01 00:00:00,8888-01-01 00:00:00,0.0,88888.0,8888-01-01 00:00:00,88888.0,88888.0,88888.0,88888.0,88888.0,88888.0,88888.0,88888.0,0,8888-01-01 00:00:00,8888-01-01 00:00:00,88888.0,,88888.0,88888.0,88888.0,88888.0,88888.0,88888.0,88888.0,88888.0,1,0,1,8888-01-01 00:00:00,8888-01-01 00:00:00,2020-03-26,,88888